{"text_format":"1","workbook":"xlsx","n_sheets":10,"sheets":["Blank","Start","Calcolo1","Normativa1","Elenco1","Riservato1","Calcolo2","Normativa2","Elenco2","Riservato2"],"not_rendered":{"charts":0,"images":18,"macros":1,"external_links":0,"defined_names":22,"comments":0,"pivot_tables":0},"unopened":[],"bounds":{"document_bytes":16777216,"sheet_cells":100000,"rows_first":2000,"rows_last":500,"rows_between":2000,"halvings":0,"cell_chars":16384,"cell_head_chars":4096},"cells_cut":0,"cells_raw":0,"read":"whole","date_system":"1900"}

{"sheet":"Blank","index":0,"n_rows":0,"n_cols":0,"rows_kept":0,"cut":false,"hidden":false,"merged":[]}

{"sheet":"Start","index":1,"n_rows":0,"n_cols":0,"rows_kept":0,"cut":false,"hidden":false,"merged":[]}

{"sheet":"Calcolo1","index":2,"n_rows":42,"n_cols":58,"rows_kept":42,"cut":false,"hidden":false,"merged":[[41,21,41,29],[3,32,14,51],[15,32,20,51],[26,21,26,29],[29,21,29,29],[19,23,19,29],[4,18,4,29],[7,18,7,29],[10,25,10,29],[13,25,13,29],[16,25,16,29],[35,21,35,29],[38,21,38,29],[32,21,32,29],[23,21,23,29]]}
[null,null,"Calcolo contributo art. 1 D.L. n. 41/2021"]
[]
[]
[]
[null,null," Cognome e nome / Denominazione",null,null,null,null,null,null,null,null,null,null,null,null,null,null,null,"Bianchi Simone"]
[]
[]
[null,null," Tipologia soggetto",null,null,null,null,null,null,null,null,null,null,null,null,null,null,null,"Persona fisica"]
[]
[]
[null,null," Attività cessata entro il 23/03/2021",null,null,null,null,null,null,null,null,null,null,null,null,null,null,null,null,null,null,null,null,null,null,"NO"]
[]
[]
[null,null," Attività iniziata dopo il 23/03/2021",null,null,null,null,null,null,null,null,null,null,null,null,null,null,null,null,null,null,null,null,null,null,"NO"]
[]
{"$rows_left_out":28}
{"sheet":"Normativa1","index":3,"n_rows":2,"n_cols":2,"rows_kept":2,"cut":false,"hidden":false,"merged":[[1,1,76,10]]}
[]
[null,"Art. 1 D.L. 41/2021\n\n Contributo a fondo perduto in favore degli operatori economici [...]\n\n1. Al fine di sostenere gli operatori economici colpiti dall’emergenza epidemiologica «Covid-19», è riconosciuto un contributo a fondo perduto a favore dei soggetti titolari di partita IVA, residenti o stabiliti nel territorio dello Stato, che svolgono attività d’impresa, arte o professione o producono reddito agrario.\n\n2. Il contributo a fondo perduto di cui al comma 1 nonspetta, in ogni caso, ai soggetti la cui attività risulti cessata alla data di entrata in vigore del presente decreto, ai soggetti che hanno attivato la partita IVA dopo l’entrata in vigore del presente decreto, agli enti pubblici di cui all’articolo 74 nonché ai soggetti di cui all’articolo 162 - bis del testo unico delle imposte sui redditi approvato con decreto del Presidente della Repubblica 22 dicembre 1986, n. 917.\n\n3. Il contributo spetta esclusivamente ai soggetti titolari di reddito agrario di cui all’articolo 32 del citato testo unico delle imposte sui redditi, nonché ai soggetti con ricavi di cui all’articolo 85, comma 1, lettere a) e b) , del testo unico delle imposte sui redditi approvato con decreto del Presidente della Repubblica 22 dicembre 1986, n. 917, o compensi di cui all’articolo 54, comma 1, del citato testo unico non superiori a 10 milioni di euro nel secondo periodo d’imposta antecedente a quello di entrata in vigore del presente decreto.\n\n4. Il contributo a fondo perduto spetta a condizione che l’ammontare medio mensile del fatturato e dei corrispettivi dell’anno 2020 sia inferiore almeno del 30 per cento rispetto all’ammontare medio mensile del fatturato e dei corrispettivi dell’anno 2019. Al fine di determinare correttamente i predetti importi, si fa riferimento alla data di effettuazione dell’operazione di cessione di beni o di prestazione dei servizi. Ai soggetti che hanno attivato la partita IVA dal 1° gennaio 2019 il contributo spetta anche in assenza dei requisiti di cui al presente comma.\n\n5. L’ammontare del contributo a fondo perduto è determinato in misura pari all’importo ottenuto applicando una percentuale alla differenza tra l’ammontare medio mensile del fatturato e dei corrispettivi dell’anno 2020 e l’ammontare medio mensile del fatturato e dei corrispettivi dell’anno 2019 come segue:\na) sessanta per cento per i soggetti con ricavi e compensi indicati al comma 3 non superiori a centomila euro;\nb) cinquanta per cento per i soggetti con ricavi o compensi indicati al comma 3 superiori a centomila euro e fino a quattrocentomila euro;\nc) quaranta per cento per i soggetti con ricavi o compensi indicati al comma 3 superiori a quattrocentomila euro e fino a 1 milione di euro;\nd) trenta per cento per i soggetti con ricavi o compensi indicati al comma 3 superiori a 1 milione di euro e fino a 5 milioni di euro;\ne) venti per cento per i soggetti con ricavi o compensi indicati al comma 3 superiori a 5 milioni di euro e fino a 10 milioni di euro.\nPer i soggetti che hanno attivato la partita IVA dal 1° gennaio 2019, ai fini della media di cui al primo periodo, rilevano i mesi successivi a quello di attivazione della partita IVA.\n\n6. Fermo quanto disposto dal comma 2, per tutti i soggetti, compresi quelli che hanno attivato la partita IVA dal 1° gennaio 2020, l’importo del contributo di cui al presente articolo non può essere superiore a centocinquantamila euro ed è riconosciuto, comunque, per un importo non inferiore a mille euro per le persone fisiche e a duemila euro per i soggetti diversi dalle persone fisiche.\n\n7. Il contributo di cui al presente articolo non concorre alla formazione della base imponibile delle imposte sui redditi, non rileva altresì ai fini del rapporto di cui agli articoli 61 e 109, comma 5, del testo unico delle imposte sui redditi, di cui al decreto del Presidente della Repubblica 22 dicembre 1986, n. 917 e non concorre alla formazione del valore della produzione netta, di cui al decreto legislativo 15 dicembre 1997, n. 446. In alternativa, a scelta irrevocabile del contribuente, il contributo a fondo perduto è riconosciuto nella sua totalità sotto forma di credito d’imposta, da utilizzare esclusivamente in compensazione ai sensi dell’articolo 17 del decreto legislativo 9 luglio 1997, n. 241, presentando il modello F24 esclusivamente tramite i servizi telematici resi disponibili dall’Agenzia delle Entrate. Ai fini di cui al secondo periodo, non si applicano i limiti di cui all’articolo 31, comma 1, del decreto- legge 31 maggio 2010, n. 78, convertito, con modificazioni, dalla legge 30 luglio 2010, n. 122, all’articolo 34 della legge 23 dicembre 2000, n. 388, e all’articolo 1, comma 53, della legge 24 dicembre 2007, n. 244.\n\n8. Al fine di ottenere il contributo a fondo perduto, i soggetti interessati presentano, esclusivamente in via telematica, una istanza all’Agenzia delle entrate con l’indicazione della sussistenza dei requisiti definiti dai precedenti commi. L’istanza può essere presentata, per conto del soggetto interessato, anche da un intermediario di cui all’articolo 3, comma 3, del decreto del Presidente della Repubblica 22 luglio 1998, n. 322 delegato al servizio del cassetto fiscale dell’Agenzia delle entrate. L’istanza deve essere presentata, a pena di decadenza, entro sessanta giorni dalla data di avvio della procedura telematica per la presentazione della stessa. Le modalità di effettuazione dell’istanza, il suo contenuto informativo, i termini di presentazione della stessa e ogni altro elemento necessario all’attuazione delle disposizioni del presente articolo sono definiti con provvedimento del Direttore dell’Agenzia delle entrate.\n\n9. Si applicano, in quanto compatibili, le disposizioni di cui all’articolo 25, commi da 9 a 14 del decreto-legge 19 maggio 2020 n. 34, convertito, con modificazioni dalla legge 17 luglio 2020, n. 77, con riferimento alle modalità di erogazione del contributo, al regime sanzionatorio e alle attività di controllo."]

{"sheet":"Elenco1","index":4,"n_rows":55,"n_cols":11,"rows_kept":55,"cut":false,"hidden":false,"merged":[]}
[null,"Elenco Clienti per richiesta contributo a fondo perduto"]
[]
[]
[null,"Prog.","Cliente","Fatturato 2019","Fatturato 2020","Riduzione su dato mensile","Spettanza contributo","Misura contributo","Domanda presentata"]
[null,null,"***** lasciare riga! *****"]
[null,1,null,null,null,null,null,null,"NO",null,{"$f":"IF(G6=\"NO\",0,IF(I6=\"SI\",1,2))","v":2}]
[null,{"$f":"B6+1","v":2},null,null,null,null,null,null,"NO",null,{"$f":"IF(G7=\"NO\",0,IF(I7=\"SI\",1,2))","v":2}]
[null,{"$f":"B7+1","v":3},null,null,null,null,null,null,"NO",null,{"$f":"IF(G8=\"NO\",0,IF(I8=\"SI\",1,2))","v":2}]
[null,4,null,null,null,null,null,null,"NO",null,2]
[null,5,null,null,null,null,null,null,"NO",null,2]
[null,6,null,null,null,null,null,null,"NO",null,2]
[null,7,null,null,null,null,null,null,"NO",null,2]
[null,8,null,null,null,null,null,null,"NO",null,2]
[null,9,null,null,null,null,null,null,"NO",null,2]
[null,10,null,null,null,null,null,null,"NO",null,2]
{"$rows_left_out":41}
{"sheet":"Riservato1","index":5,"n_rows":30,"n_cols":8,"rows_kept":30,"cut":false,"hidden":false,"merged":[]}
[]
["Limiti rilevanti:",null,"Persona fisica",1000,null,null,"**************** Determinazione dell'an ****************"]
["2019-01-01",null,"Diverso da persona fisica",2000]
["2021-03-23",null,null,null,null,null,"Ricavi > 10 mln",{"$f":"IF(ricavi2019_1>limite1,0,1)","v":1}]
["2019-12-01",null,"SI","NO",null,null,"Attività cessata",{"$f":"IF(Calcolo1!Z11=\"SI\",0,1)","v":1}]
[null,null,null,null,null,null,"Attività iniziata dopo",{"$f":"IF(Calcolo1!Z14=\"SI\",0,1)","v":1}]
[null,null,{"$f":"Calcolo1!C27","v":" Fatturato 2019"},{"$f":"IF(AND(Calcolo1!Z17=\"SI\",Calcolo1!X20>=A5),0,fatturato2019_1)","v":120000},null,null,"Riduzione fatturato",{"$f":"IF(AND(Calcolo1!Z17=\"SI\",Calcolo1!X20>=A5),1,IF(AND(Calcolo1!Z17=\"SI\",D12<30%),1,IF(D12>=30%,1,0)))","v":1}]
[null,null,{"$f":"Calcolo1!C30","v":" Fatturato 2020"},{"$f":"IF(AND(Calcolo1!Z17=\"SI\",Calcolo1!X20>=A5),0,fatturato2020_1)","v":82000},null,null,"Prodotto     =====>",{"$f":"H4*H5*H6*H7","v":1}]
[null,null,{"$f":"Calcolo1!C33","v":" Mesi rilevanti"},{"$f":"IF(Calcolo1!Z17=\"NO\",12,IF(AND(Calcolo1!Z17=\"SI\",Calcolo1!X20<A5),12-MONTH(Calcolo1!X20),0))","v":12}]
[null,null,{"$f":"Calcolo1!C36","v":" Media mensile 2019"},{"$f":"IFERROR(D7/D9,0)","v":10000}]
[null,null,{"$f":"Calcolo1!C39","v":" Media mensile 2020"},{"$f":"D8/12","v":6833.333333333333}]
[null,null,{"$f":"Calcolo1!C42","v":" Riduzione fatturato"},{"$f":"IFERROR(-D11/D10+1,0)","v":0.31666666666666665},null,null,"**************** Determinazione del quantum ****************"]
[]
[null,null,"**************** Soglie ricavi per aliquota ****************",null,null,null,"Aliquota contributo",{"$f":"IF(ricavi2019_1>D19,0,IF(ricavi2019_1>D18,E19,IF(ricavi2019_1>D17,E18,IF(ricavi2019_1>D16,E17,IF(ricavi2019_1>D15,E16,E15)))))","v":0.5}]
[null,null,0,100000,0.6,null,"Contributo potenziale",{"$f":"(D10-D11)*H14","v":1583.3333333333335}]
{"$rows_left_out":16}
{"sheet":"Calcolo2","index":6,"n_rows":42,"n_cols":58,"rows_kept":42,"cut":false,"hidden":false,"merged":[[41,21,41,29],[19,21,19,29],[23,21,23,29],[26,21,26,29],[29,21,29,29],[32,21,32,29],[35,21,35,29],[38,21,38,29],[15,32,20,51],[3,32,14,51],[4,18,4,29],[7,18,7,29],[10,25,10,29],[13,25,13,29],[16,21,16,29]]}
[null,null,"Calcolo contributo art. 1 D.L. n. 73/2021"]
[]
[]
[]
[null,null," Cognome e nome / Denominazione",null,null,null,null,null,null,null,null,null,null,null,null,null,null,null,"Russo Giuseppe"]
[]
[]
[null,null," Tipologia soggetto",null,null,null,null,null,null,null,null,null,null,null,null,null,null,null,"Persona fisica"]
[]
[]
[null,null," Attività cessata entro il 25/05/2021",null,null,null,null,null,null,null,null,null,null,null,null,null,null,null,null,null,null,null,null,null,null,"NO"]
[]
[]
[null,null," Attività iniziata dopo il 23/03/2021",null,null,null,null,null,null,null,null,null,null,null,null,null,null,null,null,null,null,null,null,null,null,"NO"]
[]
{"$rows_left_out":28}
{"sheet":"Normativa2","index":7,"n_rows":2,"n_cols":2,"rows_kept":2,"cut":false,"hidden":false,"merged":[[1,1,107,10]]}
[]
[null,"Art. 1 D.L. 73/2021\n\n Contributo a fondo perduto\n\n[...] \n5. Al  fine  di  sostenere  gli  operatori  economici  maggiormente colpiti dall'emergenza epidemiologica \"Covid-19\", è riconosciuto  un contributo a fondo perduto a favore di tutti i soggetti che  svolgono attività d'impresa, arte o  professione o che producono  reddito agrario, titolari di partita IVA residenti o stabiliti nel territorio dello Stato. Il contributo di cui al presente comma è alternativo  a quello di cui ai commi da 1 a 3. I  soggetti che, a seguito della presentazione dell'istanza per il riconoscimento del contributo di cui all'articolo 1 del decreto-legge 22 marzo 2021, n.  41, abbiano beneficiato del contributo di cui ai commi  da 1 a 3, potranno ottenere l'eventuale maggior valore del contributo determinato  ai sensi del presente comma. In tal caso, il contributo già corrisposto o riconosciuto sotto forma di credito d'imposta  dall'Agenzia delle Entrate ai sensi dei commi da 1 a 3 verrà scomputato da quello da riconoscere ai sensi del presente comma. Se dall'istanza  per  il riconoscimento del contributo di cui  al  presente  comma  emerge  un contributo inferiore rispetto a quello spettante ai sensi  dei  commi da 1 a 3, l'Agenzia non darà seguito all'istanza stessa. \n\n6. Il contributo a fondo perduto di cui al comma 5 non spetta, in ogni caso, ai soggetti la cui partita IVA  risulti non attiva alla data di entrata in vigore del presente decreto-legge, agli  enti pubblici di cui all'articolo 74, nonché ai soggetti di cui all'articolo 162-bis del Testo unico delle imposte sui redditi approvato con decreto del Presidente della Repubblica 22 dicembre 1986, n. 917. \n\n7. Il contributo di cui al comma 5 spetta esclusivamente ai soggetti titolari di reddito agrario di cui all'articolo 32 del citato Testo unico delle imposte sui redditi, nonché ai soggetti con ricavi di cui all'articolo 85, comma 1, lettere a) e b), o compensi di cui all'articolo 54, comma 1, del Testo unico delle imposte sui redditi non superiori a 10 milioni di euro nel secondo periodo d'imposta antecedente a quello di  entrata in vigore del presente decreto. \n\n8. Il contributo di cui al comma 5 spetta a condizione che l'ammontare medio mensile del fatturato e dei corrispettivi del periodo dal 1° aprile 2020 al 31 marzo 2021 sia inferiore almeno del 30 per cento rispetto all'ammontare medio mensile del fatturato e dei corrispettivi del periodo dal 1° aprile 2019 al 31 marzo 2020. Al fine di determinare correttamente i predetti importi, si fa riferimento alla data di effettuazione dell'operazione di cessione di beni o di prestazione dei servizi. \n\n9. Per i soggetti che hanno  beneficiato  del  contributo  a  fondo perduto di cui all'articolo 1 del decreto-legge 22 marzo 2021, n. 41, l'ammontare del contributo di cui al comma 5 è determinato in misura pari all'importo ottenuto applicando una percentuale alla  differenza tra l'ammontare medio mensile del fatturato e dei corrispettivi del periodo dal 1° aprile 2020 al  31  marzo  2021 e l'ammontare medio mensile del fatturato e dei corrispettivi del periodo dal  1° aprile 2019 al 31 marzo 2020 come segue: \n    a) sessanta per cento per i soggetti con ricavi e compensi indicati al comma 7 non superiori a centomila euro; \n    b) cinquanta per cento per i soggetti con ricavi o compensi indicati al comma 7 superiori a centomila euro e fino a quattrocentomila euro; \n    c) quaranta per cento per i soggetti con ricavi o compensi indicati al comma 7 superiori a quattrocentomila euro e fino a 1 milione di euro; \n    d) trenta per cento per i soggetti con ricavi o compensi indicati al comma 7 superiori a 1 milione di euro e fino a 5 milioni di euro; \n    e) venti per cento per i soggetti con ricavi o compensi  indicati al comma 7 superiori a 5 milioni di euro e fino a 10 milioni di euro. \n\n10. Per i soggetti che non hanno beneficiato del contributo a fondo perduto di cui all'articolo 1 del decreto-legge 22 marzo 2021, n. 41, l'ammontare del contributo di cui al comma 5 è determinato in misura pari all'importo ottenuto applicando una percentuale alla differenza tra l'ammontare medio mensile del fatturato e dei corrispettivi del periodo dal 1° aprile 2020 al 31 marzo 2021 e l'ammontare  medio mensile del fatturato e dei corrispettivi del periodo dal  1° aprile 2019 al 31 marzo 2020 come segue: \n    a) novanta per cento per i soggetti con ricavi e compensi indicati al comma 7 non superiori a centomila euro; \n    b) settanta per cento per i soggetti con ricavi o compensi indicati al comma 7 superiori a centomila euro e fino a quattrocentomila euro; \n    c) cinquanta per cento per i soggetti con ricavi o compensi indicati al comma 7 superiori a quattrocentomila euro e fino a 1 milione di euro; \n    d) quaranta per cento per i soggetti con ricavi o compensi indicati al comma 7 superiori a 1 milione di euro e fino a 5 milioni di euro; \n    e) trenta per cento per i soggetti con ricavi o compensi indicati al comma 7 superiori a 5 milioni di euro e fino a 10 milioni di euro. \n\n11. Per tutti i soggetti, l'importo del contributo di cui al  comma 5 non può essere superiore a centocinquantamila euro. \n\n12. Il contributo di cui al comma 5 non concorre alla formazione della base imponibile delle imposte sui redditi, non rileva altresì ai fini del rapporto di cui agli articoli 61 e 109, comma 5, del Testo unico delle imposte sui redditi approvato con decreto del Presidente della Repubblica 22 dicembre 1986, n. 917, e non concorre alla formazione del valore della produzione netta, di cui al  decreto legislativo 15 dicembre 1997, n.  446.  A scelta irrevocabile del contribuente, il contributo a fondo perduto è riconosciuto nella sua totalità sotto forma di credito d'imposta, da utilizzare esclusivamente in compensazione ai sensi dell'articolo 17 del decreto legislativo 9  luglio 1997, n. 241,  presentando il modello F24 esclusivamente tramite i servizi telematici resi disponibili dall'Agenzia delle Entrate. Ai fini di cui al periodo precedente, non si applicano i limiti di cui all'articolo 31, comma 1, del decreto-legge 31 maggio 2010, n. 78, convertito, con modificazioni, dalla legge 30 luglio 2010, n. 122, all'articolo 34  della  legge 23 dicembre 2000, n. 388, e all'articolo 1, comma  53, della legge 24 dicembre 2007, n. 244. \n\n13. Al fine di ottenere il contributo di cui al comma 5, i soggetti interessati presentano, esclusivamente in via telematica,  un'istanza all'Agenzia delle entrate con  l'indicazione  della  sussistenza  dei requisiti definiti dai commi da  5  a  10. L'istanza  può essere presentata,  per conto del soggetto  interessato, anche da un intermediario di  cui all'articolo 3, comma 3, del decreto del Presidente della Repubblica 22  luglio 1998, n. 322, delegato  al servizio del cassetto fiscale dell'Agenzia delle Entrate.  L'istanza deve essere presentata, a pena di decadenza, entro sessanta giorni dalla data di avvio della procedura telematica per la presentazione della stessa. Le modalità di effettuazione dell'istanza, il suo contenuto informativo, i termini di presentazione della stessa e ogni altro elemento necessario all'attuazione delle disposizioni dei commi da 5 a 12 sono definiti con provvedimento del direttore  dell'Agenzia delle Entrate, che individua, altresì, gli elementi da dichiarare nell'istanza al fine del  rispetto  delle condizioni e dei limiti previsti dalle Sezioni 3.1 «Aiuti di importo limitato» e 3.12 «Aiuti sotto forma di sostegno a costi fissi non coperti» della Comunicazione della Commissione europea del 19 marzo 2020 C(2020) 1863 final «Quadro temporaneo per le misure di aiuto di Stato  a sostegno dell'economia nell'attuale  emergenza  del  COVID-19», e successive modificazioni. Per i soggetti obbligati alla presentazione delle  comunicazioni  della  liquidazione  periodica   IVA   di   cui all'articolo  21-bis  del  decreto-legge 31 maggio 2010, n. 78, l'istanza può essere presentata esclusivamente dopo la presentazione della comunicazione riferita al primo trimestre 2021.\n\n14. Gli oneri derivanti dalle disposizioni di cui ai commi da 5 a 13 sono valutati in 3.400 milioni di euro per l'anno 2021. \n\n15. Ai fini del contributo di cui ai commi da 5 a 13 si  applicano, in quanto compatibili, le disposizioni di cui all'articolo 1, commi 9 e da 13 a 17, del decreto-legge 22 marzo 2021, n. 41. "]

{"sheet":"Elenco2","index":8,"n_rows":55,"n_cols":11,"rows_kept":55,"cut":false,"hidden":false,"merged":[]}
[null,"Elenco Clienti per richiesta contributo a fondo perduto"]
[]
[]
[null,"Prog.","Cliente","Fatturato      19/20","Fatturato      20/21","Riduzione su dato mensile","Spettanza contributo","Misura contributo","Domanda presentata"]
[null,null,"***** lasciare riga! *****"]
[null,1,null,null,null,null,null,null,"NO",null,{"$f":"IF(G6=\"NO\",0,IF(I6=\"SI\",1,2))","v":2}]
[null,{"$f":"B6+1","v":2},null,null,null,null,null,null,"NO",null,{"$f":"IF(G7=\"NO\",0,IF(I7=\"SI\",1,2))","v":2}]
[null,{"$f":"B7+1","v":3},null,null,null,null,null,null,"NO",null,{"$f":"IF(G8=\"NO\",0,IF(I8=\"SI\",1,2))","v":2}]
[null,4,null,null,null,null,null,null,"NO",null,2]
[null,5,null,null,null,null,null,null,"NO",null,2]
[null,6,null,null,null,null,null,null,"NO",null,2]
[null,7,null,null,null,null,null,null,"NO",null,2]
[null,8,null,null,null,null,null,null,"NO",null,2]
[null,9,null,null,null,null,null,null,"NO",null,2]
[null,10,null,null,null,null,null,null,"NO",null,2]
{"$rows_left_out":41}
{"sheet":"Riservato2","index":9,"n_rows":63,"n_cols":8,"rows_kept":63,"cut":false,"hidden":false,"merged":[]}
[]
["Date rilevanti:",null,"Persona fisica",1000,null,null,"**************** Determinazione dell'an ****************"]
["2019-04-01",null,"Diverso da persona fisica",2000]
["2021-05-25",null,"Contributo minimo",{"$f":"IF(Calcolo2!S8=C2,Riservato2!D2,Riservato2!D3)","v":1000},null,null,"Ricavi > 10 mln",{"$f":"IF(ricavi2019_2>limite2,0,1)","v":1}]
["2020-03-01",null,null,null,null,null,"Attività cessata",{"$f":"IF(Calcolo2!Z11=\"SI\",0,1)","v":1}]
["2020-01-01",null,null,null,null,null,"Attività iniziata dopo",{"$f":"IF(Calcolo2!Z14=\"SI\",0,1)","v":1}]
[{"$f":"IF(AND(Calcolo2!V20>=A6,ricavi2019_2<>0),1,0)","v":0},null,{"$f":"Calcolo2!C27","v":" Fatturato 01/04/2019 - 31/03/2020"},{"$f":"fatturato2019_2","v":110000},null,null,"Riduzione fatturato",{"$f":"IF(A9=1,1,IF(D12>=30%,1,0))","v":1}]
["2020-03-31",null,{"$f":"Calcolo2!C30","v":" Fatturato 01/04/2020 - 31/03/2021"},{"$f":"fatturato2020_2","v":72000},null,null,"Prodotto     =====>",{"$f":"H4*H5*H6*H7","v":1}]
[{"$f":"IF(Calcolo2!V20>=A5,1,0)","v":0},null,{"$f":"Calcolo1!C33","v":" Mesi rilevanti"},{"$f":"IF(Calcolo2!V20=\"\",12,IF(Calcolo2!V20<=A8,VLOOKUP(MONTH(Calcolo2!V20),A52:B63,2,FALSE),0))","v":12}]
[{"$f":"Riservato1!A5","v":"2019-12-01"},null,{"$f":"Calcolo2!C36","v":" Media mensile 2019/2020"},{"$f":"IFERROR(D7/D9,0)","v":9166.6666666666661}]
[null,null,{"$f":"Calcolo2!C39","v":" Media mensile 2020/2021"},{"$f":"D8/12","v":6000}]
[null,null,{"$f":"Calcolo1!C42","v":" Riduzione fatturato"},{"$f":"IFERROR(-D11/D10+1,0)","v":0.34545454545454546},{"$f":"IF(D12>=30%,1,0)","v":1}]
[]
[null,null,"**************** Soglie ricavi per aliquota (CONTRIBUTO GIÀ PERCEPITO) ****************",null,null,null,"**************** Determinazione del quantum (CONTRIBUTO GIÀ PERCEPITO) ****************"]
[null,null,0,100000,0.6,null,"Aliquota contributo",{"$f":"IF(ricavi2019_2>D19,0,IF(ricavi2019_2>D18,E19,IF(ricavi2019_2>D17,E18,IF(ricavi2019_2>D16,E17,IF(ricavi2019_2>D15,E16,E15)))))","v":0.5}]
{"$rows_left_out":48}